Reaction Details
TargetATP-dependent translocase ABCB1
LigandBDBM50221825
Substrate/Competitorn/a
Meas. Tech.ChEMBL_446267 (CHEMBL895371)
Ki 910±n/a nM
Citation Reyes, CPMuñoz-Martínez, FTorrecillas, IRMendoza, CRGamarro, FBazzocchi, ILNúñez, MJPardo, LCastanys, SCampillo, MJiménez, IA Biological evaluation, structure-activity relationships, and three-dimensional quantitative structure-activity relationship studies of dihydro-beta-agarofuran sesquiterpenes as modulators of P-glycoprotein-dependent multidrug resistance. J Med Chem50:4808-17 (2007) 
 
ATP-dependent translocase ABCB1
Name:ATP-dependent translocase ABCB1
Type:Protein
Mol. Mass.:141503.50
Organism:Homo sapiens (Human)
Description:P08183
Residue:1280
BDBM50221825
NameBDBM50221825
Synonyms:(1S,2R,4S,5R,6S,7R,8S,9R,12R)-4,12-bis(acetyloxy)-5,8-bis(benzoyloxy)-2-hydroxy-2,6,10,10-tetramethyl-11-oxatricyclo[7.2.1.0^{1,6}]dodecan-7-yl benzoate | CHEMBL412967
TypeSmall organic molecule
Emp. Form.C40H42O12
Mol. Mass.714.7543
SMILESCC(=O)O[C@@H]1[C@H]2[C@H](OC(=O)c3ccccc3)[C@H](OC(=O)c3ccccc3)[C@]3(C)[C@@H](OC(=O)c4ccccc4)[C@H](C[C@@](C)(O)[C@@]13OC2(C)C)OC(C)=O