Reaction Details
TargetATP-dependent translocase ABCB1
LigandBDBM50221835
Substrate/Competitorn/a
Meas. Tech.ChEMBL_446267 (CHEMBL895371)
Ki 3010±n/a nM
Citation Reyes, CPMuñoz-Martínez, FTorrecillas, IRMendoza, CRGamarro, FBazzocchi, ILNúñez, MJPardo, LCastanys, SCampillo, MJiménez, IA Biological evaluation, structure-activity relationships, and three-dimensional quantitative structure-activity relationship studies of dihydro-beta-agarofuran sesquiterpenes as modulators of P-glycoprotein-dependent multidrug resistance. J Med Chem50:4808-17 (2007) 
 
ATP-dependent translocase ABCB1
Name:ATP-dependent translocase ABCB1
Type:Protein
Mol. Mass.:141503.50
Organism:Homo sapiens (Human)
Description:P08183
Residue:1280
BDBM50221835
NameBDBM50221835
Synonyms:(1S,2R,4S,5R,6S,7S,9R,12R)-4,12-bis(acetyloxy)-6-[(acetyloxy)methyl]-7-(benzoyloxy)-2-hydroxy-2,10,10-trimethyl-8-oxo-11-oxatricyclo[7.2.1.0^{1,6}]dodecan-5-yl benzoate | CHEMBL413894
TypeSmall organic molecule
Emp. Form.C35H38O13
Mol. Mass.666.6684
SMILESCC(=O)OC[C@@]12[C@@H](OC(=O)c3ccccc3)[C@H](C[C@@](C)(O)[C@]11OC(C)(C)[C@@H]([C@H]1OC(C)=O)C(=O)[C@H]2OC(=O)c1ccccc1)OC(C)=O