Reaction Details
TargetATP-dependent translocase ABCB1
LigandBDBM50221847
Substrate/Competitorn/a
Meas. Tech.ChEMBL_446267 (CHEMBL895371)
Ki 2190±n/a nM
Citation Reyes, CPMuñoz-Martínez, FTorrecillas, IRMendoza, CRGamarro, FBazzocchi, ILNúñez, MJPardo, LCastanys, SCampillo, MJiménez, IA Biological evaluation, structure-activity relationships, and three-dimensional quantitative structure-activity relationship studies of dihydro-beta-agarofuran sesquiterpenes as modulators of P-glycoprotein-dependent multidrug resistance. J Med Chem50:4808-17 (2007) 
 
ATP-dependent translocase ABCB1
Name:ATP-dependent translocase ABCB1
Type:Protein
Mol. Mass.:141503.50
Organism:Homo sapiens (Human)
Description:P08183
Residue:1280
BDBM50221847
NameBDBM50221847
Synonyms:(1S,2R,4S,5R,6R,7S,9R,12R)-5-(acetyloxy)-4,12-bis[(furan-2-yl)carbonyloxy]-2-hydroxy-2,6,10,10-tetramethyl-11-oxatricyclo[7.2.1.0^{1,6}]dodecan-7-yl furan-2-carboxylate | CHEMBL397350
TypeSmall organic molecule
Emp. Form.C32H34O13
Mol. Mass.626.6046
SMILESCC(=O)O[C@H]1[C@H](C[C@@](C)(O)[C@]23OC(C)(C)[C@H](C[C@H](OC(=O)c4ccco4)[C@]12C)[C@H]3OC(=O)c1ccco1)OC(=O)c1ccco1