Reaction Details
TargetATP-dependent translocase ABCB1
LigandBDBM50221856
Substrate/Competitorn/a
Meas. Tech.ChEMBL_446267 (CHEMBL895371)
Ki 960±n/a nM
Citation Reyes, CPMuñoz-Martínez, FTorrecillas, IRMendoza, CRGamarro, FBazzocchi, ILNúñez, MJPardo, LCastanys, SCampillo, MJiménez, IA Biological evaluation, structure-activity relationships, and three-dimensional quantitative structure-activity relationship studies of dihydro-beta-agarofuran sesquiterpenes as modulators of P-glycoprotein-dependent multidrug resistance. J Med Chem50:4808-17 (2007) 
 
ATP-dependent translocase ABCB1
Name:ATP-dependent translocase ABCB1
Type:Protein
Mol. Mass.:141503.50
Organism:Homo sapiens (Human)
Description:P08183
Residue:1280
BDBM50221856
NameBDBM50221856
Synonyms:CHEMBL412860 | furan-2-carboxylic acid (1S,2R,4S,5R,6R,7S,9R,12R)-4,5-diacetoxy-12-(2,2-dimethyl-propionyloxy)-2-hydroxy-2,6,10,10-tetramethyl-11-oxa-tricyclo[7.2.1.0*1,6*]dodec-7-yl ester
TypeSmall organic molecule
Emp. Form.C29H40O11
Mol. Mass.564.6213
SMILESCC(=O)O[C@H]1C[C@@](C)(O)[C@]23OC(C)(C)[C@H](C[C@H](OC(=O)c4ccco4)[C@]2(C)[C@H]1OC(C)=O)[C@H]3OC(=O)C(C)(C)C