Reaction Details
TargetATP-dependent translocase ABCB1
LigandBDBM50221877
Substrate/Competitorn/a
Meas. Tech.ChEMBL_446267 (CHEMBL895371)
Ki 2070±n/a nM
Citation Reyes, CPMuñoz-Martínez, FTorrecillas, IRMendoza, CRGamarro, FBazzocchi, ILNúñez, MJPardo, LCastanys, SCampillo, MJiménez, IA Biological evaluation, structure-activity relationships, and three-dimensional quantitative structure-activity relationship studies of dihydro-beta-agarofuran sesquiterpenes as modulators of P-glycoprotein-dependent multidrug resistance. J Med Chem50:4808-17 (2007) 
 
ATP-dependent translocase ABCB1
Name:ATP-dependent translocase ABCB1
Type:Protein
Mol. Mass.:141503.50
Organism:Homo sapiens (Human)
Description:P08183
Residue:1280
BDBM50221877
NameBDBM50221877
Synonyms:CHEMBL397135 | nicotinic acid (1R,2R,3S,4S,5R,6R,7S,9R)-4-acetoxy-7-benzoyloxy-2-hydroxy-2,6,10,10-tetramethyl-5-[(E)-(3-phenyl-acryloyl)oxy]-11-oxa-tricyclo[7.2.1.0*1,6*]dodec-3-yl ester
TypeSmall organic molecule
Emp. Form.C39H41NO10
Mol. Mass.683.7435
SMILESCC(=O)O[C@@H]1[C@H](OC(=O)c2cccnc2)[C@@](C)(O)[C@@]23C[C@@H](C[C@H](OC(=O)c4ccccc4)[C@]2(C)[C@H]1OC(=O)\C=C\c1ccccc1)C(C)(C)O3