Reaction Details
TargetNeuronal acetylcholine receptor subunit alpha-7
LigandBDBM50221882
Substrate/Competitorn/a
Meas. Tech.ChEMBL_446272 (CHEMBL895375)
Ki 90±n/a nM
Citation Guandalini, LNorcini, MVarani, KPistolozzi, MGotti, CBazzicalupi, CMartini, EDei, SManetti, DScapecchi, STeodori, EBertucci, CGhelardini, CRomanelli, MN Design, synthesis, and preliminary pharmacological evaluation of new quinoline derivatives as nicotinic ligands. J Med Chem50:4993-5002 (2007) 
 
Neuronal acetylcholine receptor subunit alpha-7
Name:Neuronal acetylcholine receptor subunit alpha-7
Type:Enzyme
Mol. Mass.:56502.44
Organism:Rattus norvegicus (Rat)
Description:Q05941
Residue:502
BDBM50221882
NameBDBM50221882
Synonyms:(R)-1,1-Dimethyl-2-quinolin-6-yl-pyrrolidinium; iodide | CHEMBL389982
TypeSmall organic molecule
Emp. Form.C15H19N2
Mol. Mass.227.3242
SMILESC[N+]1(C)CCC[C@@H]1c1ccc2ncccc2c1