Reaction Details
TargetGrowth hormone secretagogue receptor type 1
LigandBDBM50222173
Substrate/Competitorn/a
Meas. Tech.ChEMBL_449846 (CHEMBL897910)
Ki 1270±n/a nM
Citation Hernández, ASCheng, PTMusial, CMSwartz, SGGeorge, RJGrover, GSlusarchyk, DSeethala, RKSmith, MDickinson, KGiupponi, LLonghi, DAFlynn, NMurphy, BJGordon, DABiller, SARobl, JATino, JA Discovery, synthesis, and structure-activity studies of tetrazole based growth hormone secretagogues. Bioorg Med Chem Lett17:5928-33 (2007) 
 
Growth hormone secretagogue receptor type 1
Name:Growth hormone secretagogue receptor type 1
Type:Receptor
Mol. Mass.:41334.57
Organism:Homo sapiens (Human)
Description:Receptor binding studies use plasma membranes from LLC PK-1 cells transiently transfected with hGHSR1a.
Residue:366
BDBM50222173
NameBDBM50222173
Synonyms:(S)-2-amino-N-(2-(benzyloxy)-1-(2-(2-(1-(methylsulfonyl)-1H-indol-2-yl)ethyl)-2H-tetrazol-5-yl)ethyl)-2-methylpropanamide | CHEMBL438154
TypeSmall organic molecule
Emp. Form.C25H31N7O4S
Mol. Mass.525.623
SMILESCC(C)(N)C(=O)N[C@H](COCc1ccccc1)c1nnn(CCc2cc3ccccc3n2S(C)(=O)=O)n1