Reaction Details
TargetPolyunsaturated fatty acid lipoxygenase ALOX15B
LigandBDBM26660
Substrate/Competitorn/a
Meas. Tech.ChEMBL_457827 (CHEMBL924097)
IC50>100000±n/a nM
Citation Vasquez-Martinez, YOhri, RVKenyon, VHolman, TRSepúlveda-Boza, S Structure-activity relationship studies of flavonoids as potent inhibitors of human platelet 12-hLO, reticulocyte 15-hLO-1, and prostate epithelial 15-hLO-2. Bioorg Med Chem15:7408-25 (2007) 
 
Polyunsaturated fatty acid lipoxygenase ALOX15B
Name:Polyunsaturated fatty acid lipoxygenase ALOX15B
Type:Protein
Mol. Mass.:75850.40
Organism:Homo sapiens (Human)
Description:n/a
Residue:676
BDBM26660
NameBDBM26660
Synonyms:3,7-dihydroxy-2-phenyl-4H-chromen-4-one CHEMBL210276
TypeFlavonoid
Emp. Form.C15H10O4
Mol. Mass.254.2375
SMILESOc1ccc2c(c1)oc(-c1ccccc1)c(O)c2=O