Reaction Details
TargetPolyunsaturated fatty acid lipoxygenase ALOX12
LigandBDBM50222278
Substrate/Competitorn/a
Meas. Tech.ChEMBL_457824 (CHEMBL924094)
IC50 6400±n/a nM
Citation Vasquez-Martinez, YOhri, RVKenyon, VHolman, TRSepúlveda-Boza, S Structure-activity relationship studies of flavonoids as potent inhibitors of human platelet 12-hLO, reticulocyte 15-hLO-1, and prostate epithelial 15-hLO-2. Bioorg Med Chem15:7408-25 (2007) 
 
Polyunsaturated fatty acid lipoxygenase ALOX12
Name:Polyunsaturated fatty acid lipoxygenase ALOX12
Type:Protein
Mol. Mass.:75689.18
Organism:Homo sapiens (Human)
Description:P18054
Residue:663
BDBM50222278
NameBDBM50222278
Synonyms:7,8-dihydroxyisoflavone | CHEMBL241813
TypeSmall organic molecule
Emp. Form.C15H10O4
Mol. Mass.254.2375
SMILESOc1ccc2c(occ(-c3ccccc3)c2=O)c1O