Reaction Details
TargetPolyunsaturated fatty acid lipoxygenase ALOX15
LigandBDBM50222284
Substrate/Competitorn/a
Meas. Tech.ChEMBL_457825 (CHEMBL924095)
IC50 11000±n/a nM
Citation Vasquez-Martinez, YOhri, RVKenyon, VHolman, TRSepúlveda-Boza, S Structure-activity relationship studies of flavonoids as potent inhibitors of human platelet 12-hLO, reticulocyte 15-hLO-1, and prostate epithelial 15-hLO-2. Bioorg Med Chem15:7408-25 (2007) 
 
Polyunsaturated fatty acid lipoxygenase ALOX15
Name:Polyunsaturated fatty acid lipoxygenase ALOX15
Type:Protein
Mol. Mass.:74804.05
Organism:Homo sapiens (Human)
Description:n/a
Residue:662
BDBM50222284
NameBDBM50222284
Synonyms:7,8-dihydroxy-3'-methylisoflavone IR-309
TypeSmall organic molecule
Emp. Form.C16H12O4
Mol. Mass.268.2641
SMILESCc1cccc(c1)-c1coc2c(O)c(O)ccc2c1=O