Reaction Details
TargetPolyunsaturated fatty acid lipoxygenase ALOX15
LigandBDBM50222293
Substrate/Competitorn/a
Meas. Tech.ChEMBL_457825 (CHEMBL924095)
IC50 9000±n/a nM
Citation Vasquez-Martinez, YOhri, RVKenyon, VHolman, TRSepúlveda-Boza, S Structure-activity relationship studies of flavonoids as potent inhibitors of human platelet 12-hLO, reticulocyte 15-hLO-1, and prostate epithelial 15-hLO-2. Bioorg Med Chem15:7408-25 (2007) 
 
Polyunsaturated fatty acid lipoxygenase ALOX15
Name:Polyunsaturated fatty acid lipoxygenase ALOX15
Type:Protein
Mol. Mass.:74804.05
Organism:Homo sapiens (Human)
Description:n/a
Residue:662
BDBM50222293
NameBDBM50222293
Synonyms:4'-chloro-7,8-dihydroxyisoflavone | CHEMBL241814
TypeSmall organic molecule
Emp. Form.C15H9ClO4
Mol. Mass.288.683
SMILESOc1ccc2c(occ(-c3ccc(Cl)cc3)c2=O)c1O