Reaction Details
TargetPolyunsaturated fatty acid lipoxygenase ALOX15
LigandBDBM50222276
Substrate/Competitorn/a
Meas. Tech.ChEMBL_457825 (CHEMBL924095)
IC50 150±n/a nM
Citation Vasquez-Martinez, YOhri, RVKenyon, VHolman, TRSepúlveda-Boza, S Structure-activity relationship studies of flavonoids as potent inhibitors of human platelet 12-hLO, reticulocyte 15-hLO-1, and prostate epithelial 15-hLO-2. Bioorg Med Chem15:7408-25 (2007) 
 
Polyunsaturated fatty acid lipoxygenase ALOX15
Name:Polyunsaturated fatty acid lipoxygenase ALOX15
Type:Protein
Mol. Mass.:74804.05
Organism:Homo sapiens (Human)
Description:n/a
Residue:662
BDBM50222276
NameBDBM50222276
Synonyms:6,7-dihydroxy-4'-methoxyisoflavan | CHEMBL239247
TypeSmall organic molecule
Emp. Form.C16H16O4
Mol. Mass.272.2958
SMILESCOc1ccc(cc1)C1COc2cc(O)c(O)cc2C1