Reaction Details
TargetPolyunsaturated fatty acid lipoxygenase ALOX12
LigandBDBM50222307
Substrate/Competitorn/a
Meas. Tech.ChEMBL_457824 (CHEMBL924094)
IC50 11000±n/a nM
Citation Vasquez-Martinez, YOhri, RVKenyon, VHolman, TRSepúlveda-Boza, S Structure-activity relationship studies of flavonoids as potent inhibitors of human platelet 12-hLO, reticulocyte 15-hLO-1, and prostate epithelial 15-hLO-2. Bioorg Med Chem15:7408-25 (2007) 
 
Polyunsaturated fatty acid lipoxygenase ALOX12
Name:Polyunsaturated fatty acid lipoxygenase ALOX12
Type:Protein
Mol. Mass.:75689.18
Organism:Homo sapiens (Human)
Description:P18054
Residue:663
BDBM50222307
NameBDBM50222307
Synonyms:6,7-dihydroxy-3',4'-methylenedioxyisoflavan | CHEMBL239677
TypeSmall organic molecule
Emp. Form.C16H14O5
Mol. Mass.286.2794
SMILESOc1cc2CC(COc2cc1O)c1ccc2OCOc2c1