Reaction Details
TargetIntegrin alpha-5/beta-1
LigandBDBM50222349
Substrate/Competitorn/a
Meas. Tech.ChEMBL_449874 (CHEMBL898978)
IC50 57±n/a nM
Citation Benfatti, FCardillo, GFabbroni, SGalzerano, PGentilucci, LJuris, RTolomelli, ABaiula, MSpartà, ASpampinato, S Synthesis and biological evaluation of non-peptide alpha(v)beta(3)/alpha(5)beta(1) integrin dual antagonists containing 5,6-dihydropyridin-2-one scaffolds. Bioorg Med Chem15:7380-90 (2007) 
 
Integrin alpha-5/beta-1
Name:Integrin alpha-5/beta-1
Type:Enzyme
Mol. Mass.:n/a
Description:n/a
Components:This complex has 2 components.
Component 1
Name:Integrin alpha-5
Synonyms:CD49 antigen-like family member E FNRA Fibronectin receptor subunit alpha ITGA5 Integrin alpha-F | VLA-5
Type:Single-pass type I membrane protein
Mol. Mass.:114523.00
Organism:Homo sapiens (Human)
Description:n/a
Residue:1049
Component 2
Name:Integrin beta-1
Synonyms:CD_antigen=CD29 Fibronectin receptor beta GPIIA ITGB1 MDF2 | MSK12
Type:Enzyme
Mol. Mass.:88400.38
Organism:Homo sapiens (Human)
Description:P05556
Residue:798
BDBM50222349
NameBDBM50222349
Synonyms:2-{[(6S)-1-[(1S)-1-(4-aminophenyl)ethyl]-4-methyl-2-oxo-6-phenyl-1,2,5,6-tetrahydropyridin-3-yl](propyl)carbamoyl}acetic acid | CHEMBL392691
TypeSmall organic molecule
Emp. Form.C26H31N3O4
Mol. Mass.449.542
SMILESCCCN(C(=O)CC(O)=O)C1=C(C)C[C@H](N([C@@H](C)c2ccc(N)cc2)C1=O)c1ccccc1