Reaction Details
TargetEpidermal growth factor receptor
LigandBDBM50222417
Substrate/Competitorn/a
Meas. Tech.ChEMBL_457867 (CHEMBL925198)
IC50 13±n/a nM
Citation Kitano, YSuzuki, TKawahara, EYamazaki, T Synthesis and inhibitory activity of 4-alkynyl and 4-alkenylquinazolines: identification of new scaffolds for potent EGFR tyrosine kinase inhibitors. Bioorg Med Chem Lett17:5863-7 (2007) 
 
Epidermal growth factor receptor
Name:Epidermal growth factor receptor
Type:Receptor Kinase Domain
Mol. Mass.:134279.59
Organism:Homo sapiens (Human)
Description:P00533
Residue:1210
BDBM50222417
NameBDBM50222417
Synonyms:4-(3,3-dimethyl-4-phenylbut-1-ynyl)-6,7-dimethoxyquinazoline | CHEMBL399953
TypeSmall organic molecule
Emp. Form.C22H22N2O2
Mol. Mass.346.4223
SMILESCOc1cc2ncnc(C#CC(C)(C)Cc3ccccc3)c2cc1OC