Reaction Details
TargetEpidermal growth factor receptor
LigandBDBM50222436
Substrate/Competitorn/a
Meas. Tech.ChEMBL_457867 (CHEMBL925198)
IC50 33±n/a nM
Citation Kitano, YSuzuki, TKawahara, EYamazaki, T Synthesis and inhibitory activity of 4-alkynyl and 4-alkenylquinazolines: identification of new scaffolds for potent EGFR tyrosine kinase inhibitors. Bioorg Med Chem Lett17:5863-7 (2007) 
 
Epidermal growth factor receptor
Name:Epidermal growth factor receptor
Type:Receptor Kinase Domain
Mol. Mass.:134279.59
Organism:Homo sapiens (Human)
Description:P00533
Residue:1210
BDBM50222436
NameBDBM50222436
Synonyms:(R)-1-(4-(6,7-dimethoxyquinazolin-4-yl)-2-methyl-1-phenylbut-3-yn-2-yl)piperidine-4-carboxylic acid | CHEMBL398959
TypeSmall organic molecule
Emp. Form.C27H29N3O4
Mol. Mass.459.5369
SMILESCOc1cc2ncnc(C#CC(C)(Cc3ccccc3)N3CCC(CC3)C(O)=O)c2cc1OC