Reaction Details
TargetEpidermal growth factor receptor
LigandBDBM50222439
Substrate/Competitorn/a
Meas. Tech.ChEMBL_457867 (CHEMBL925198)
IC50 10±n/a nM
Citation Kitano, YSuzuki, TKawahara, EYamazaki, T Synthesis and inhibitory activity of 4-alkynyl and 4-alkenylquinazolines: identification of new scaffolds for potent EGFR tyrosine kinase inhibitors. Bioorg Med Chem Lett17:5863-7 (2007) 
 
Epidermal growth factor receptor
Name:Epidermal growth factor receptor
Type:Receptor Kinase Domain
Mol. Mass.:134279.59
Organism:Homo sapiens (Human)
Description:P00533
Residue:1210
BDBM50222439
NameBDBM50222439
Synonyms:6,7-diethoxy-4-(2-(3-phenyl-1H-pyrrol-2-yl)ethynyl)quinazoline | CHEMBL251124
TypeSmall organic molecule
Emp. Form.C24H21N3O2
Mol. Mass.383.4424
SMILESCCOc1cc2ncnc(C#Cc3[nH]ccc3-c3ccccc3)c2cc1OCC