Reaction Details
TargetVascular endothelial growth factor receptor 2
LigandBDBM50222496
Substrate/Competitorn/a
Meas. Tech.ChEMBL_457937 (CHEMBL925259)
Ki 70±n/a nM
Citation Dominguez, CSmith, LHuang, QYuan, COuyang, XCai, LChen, PKim, JHarvey, TSyed, RKim, TSTasker, AWang, LZhang, MCoxon, ABready, JStarnes, CChen, DGan, YNeervannan, SKumar, GPolverino, AKendall, R Discovery of N-phenyl nicotinamides as potent inhibitors of Kdr. Bioorg Med Chem Lett17:6003-8 (2007) 
 
Vascular endothelial growth factor receptor 2
Name:Vascular endothelial growth factor receptor 2
Type:Receptor Tyrosine Kinase
Mol. Mass.:151510.97
Organism:Homo sapiens (Human)
Description:P35968
Residue:1356
BDBM50222496
NameBDBM50222496
Synonyms:2-(1H-indazol-6-ylamino)-N-(4-phenoxyphenyl)nicotinamide | CHEMBL249611
TypeSmall organic molecule
Emp. Form.C25H19N5O2
Mol. Mass.421.4507
SMILESO=C(Nc1ccc(Oc2ccccc2)cc1)c1cccnc1Nc1ccc2cn[nH]c2c1