Reaction Details
TargetVascular endothelial growth factor receptor 2
LigandBDBM50222499
Substrate/Competitorn/a
Meas. Tech.ChEMBL_457937 (CHEMBL925259)
Ki 2±n/a nM
Citation Dominguez, CSmith, LHuang, QYuan, COuyang, XCai, LChen, PKim, JHarvey, TSyed, RKim, TSTasker, AWang, LZhang, MCoxon, ABready, JStarnes, CChen, DGan, YNeervannan, SKumar, GPolverino, AKendall, R Discovery of N-phenyl nicotinamides as potent inhibitors of Kdr. Bioorg Med Chem Lett17:6003-8 (2007) 
 
Vascular endothelial growth factor receptor 2
Name:Vascular endothelial growth factor receptor 2
Type:Receptor Tyrosine Kinase
Mol. Mass.:151510.97
Organism:Homo sapiens (Human)
Description:P35968
Residue:1356
BDBM50222499
NameBDBM50222499
Synonyms:CHEMBL401153 | N-(3-chlorophenyl)-2-(pyridin-4-ylmethylamino)nicotinamide
TypeSmall organic molecule
Emp. Form.C18H15ClN4O
Mol. Mass.338.791
SMILESClc1cccc(NC(=O)c2cccnc2NCc2ccncc2)c1