Reaction Details
TargetVascular endothelial growth factor receptor 2
LigandBDBM50222498
Substrate/Competitorn/a
Meas. Tech.ChEMBL_457937 (CHEMBL925259)
Ki 8±n/a nM
Citation Dominguez, CSmith, LHuang, QYuan, COuyang, XCai, LChen, PKim, JHarvey, TSyed, RKim, TSTasker, AWang, LZhang, MCoxon, ABready, JStarnes, CChen, DGan, YNeervannan, SKumar, GPolverino, AKendall, R Discovery of N-phenyl nicotinamides as potent inhibitors of Kdr. Bioorg Med Chem Lett17:6003-8 (2007) 
 
Vascular endothelial growth factor receptor 2
Name:Vascular endothelial growth factor receptor 2
Type:Receptor Tyrosine Kinase
Mol. Mass.:151510.97
Organism:Homo sapiens (Human)
Description:P35968
Residue:1356
BDBM50222498
NameBDBM50222498
Synonyms:CHEMBL400512 | N-(3,5-bis(trifluoromethyl)phenyl)-2-(pyridin-4-ylmethylamino)nicotinamide
TypeSmall organic molecule
Emp. Form.C20H14F6N4O
Mol. Mass.440.3418
SMILESFC(F)(F)c1cc(NC(=O)c2cccnc2NCc2ccncc2)cc(c1)C(F)(F)F