Reaction Details
TargetVascular endothelial growth factor receptor 2
LigandBDBM50222501
Substrate/Competitorn/a
Meas. Tech.ChEMBL_457937 (CHEMBL925259)
Ki 4±n/a nM
Citation Dominguez, CSmith, LHuang, QYuan, COuyang, XCai, LChen, PKim, JHarvey, TSyed, RKim, TSTasker, AWang, LZhang, MCoxon, ABready, JStarnes, CChen, DGan, YNeervannan, SKumar, GPolverino, AKendall, R Discovery of N-phenyl nicotinamides as potent inhibitors of Kdr. Bioorg Med Chem Lett17:6003-8 (2007) 
 
Vascular endothelial growth factor receptor 2
Name:Vascular endothelial growth factor receptor 2
Type:Receptor Tyrosine Kinase
Mol. Mass.:151510.97
Organism:Homo sapiens (Human)
Description:P35968
Residue:1356
BDBM50222501
NameBDBM50222501
Synonyms:CHEMBL250684 | N-(4-chloro-3-(trifluoromethyl)phenyl)-2-(pyridin-4-ylmethylamino)nicotinamide
TypeSmall organic molecule
Emp. Form.C19H14ClF3N4O
Mol. Mass.406.789
SMILESFC(F)(F)c1cc(NC(=O)c2cccnc2NCc2ccncc2)ccc1Cl