Reaction Details
TargetVascular endothelial growth factor receptor 2
LigandBDBM50222518
Substrate/Competitorn/a
Meas. Tech.ChEMBL_457937 (CHEMBL925259)
Ki>20000±n/a nM
Citation Dominguez, CSmith, LHuang, QYuan, COuyang, XCai, LChen, PKim, JHarvey, TSyed, RKim, TSTasker, AWang, LZhang, MCoxon, ABready, JStarnes, CChen, DGan, YNeervannan, SKumar, GPolverino, AKendall, R Discovery of N-phenyl nicotinamides as potent inhibitors of Kdr. Bioorg Med Chem Lett17:6003-8 (2007) 
 
Vascular endothelial growth factor receptor 2
Name:Vascular endothelial growth factor receptor 2
Type:Receptor Tyrosine Kinase
Mol. Mass.:151510.97
Organism:Homo sapiens (Human)
Description:P35968
Residue:1356
BDBM50222518
NameBDBM50222518
Synonyms:2-(benzo[b]thiophen-3-ylamino)-N-(4-phenoxyphenyl)nicotinamide | CHEMBL403349
TypeSmall organic molecule
Emp. Form.C26H19N3O2S
Mol. Mass.437.513
SMILESO=C(Nc1ccc(Oc2ccccc2)cc1)c1cccnc1Nc1csc2ccccc12