Reaction Details
TargetVascular endothelial growth factor receptor 2
LigandBDBM50222522
Substrate/Competitorn/a
Meas. Tech.ChEMBL_457937 (CHEMBL925259)
Ki 135±n/a nM
Citation Dominguez, CSmith, LHuang, QYuan, COuyang, XCai, LChen, PKim, JHarvey, TSyed, RKim, TSTasker, AWang, LZhang, MCoxon, ABready, JStarnes, CChen, DGan, YNeervannan, SKumar, GPolverino, AKendall, R Discovery of N-phenyl nicotinamides as potent inhibitors of Kdr. Bioorg Med Chem Lett17:6003-8 (2007) 
 
Vascular endothelial growth factor receptor 2
Name:Vascular endothelial growth factor receptor 2
Type:Receptor Tyrosine Kinase
Mol. Mass.:151510.97
Organism:Homo sapiens (Human)
Description:P35968
Residue:1356
BDBM50222522
NameBDBM50222522
Synonyms:2-(4-fluorophenylamino)-N-(4-phenoxyphenyl)nicotinamide | CHEMBL248820
TypeSmall organic molecule
Emp. Form.C24H18FN3O2
Mol. Mass.399.417
SMILESFc1ccc(Nc2ncccc2C(=O)Nc2ccc(Oc3ccccc3)cc2)cc1