Reaction Details
TargetHistone deacetylase 6
LigandBDBM50222727
Substrate/Competitorn/a
Meas. Tech.ChEMBL_457995 (CHEMBL925326)
IC50 43±n/a nM
Citation Shivashimpi, GMAmagai, SKato, TNishino, NMaeda, SNishino, TGYoshida, M Molecular design of histone deacetylase inhibitors by aromatic ring shifting in chlamydocin framework. Bioorg Med Chem15:7830-9 (2007) 
 
Histone deacetylase 6
Name:Histone deacetylase 6
Type:PROTEIN
Mol. Mass.:125762.28
Organism:Mus musculus
Description:ChEMBL_1460074
Residue:1149
BDBM50222727
NameBDBM50222727
Synonyms:(5S,11S,13aR)-5,8,8-trimethyl-11-[5-(pyridin-2-yldisulfanyl)-pentyl]-decahydro-3a,6,9,12-tetraaza-cyclopetacyclododecene-4,7,10,13-tetraone cyclo(-L-Am7(S2Py)-Aib-L-Ala-D-Pro-)
TypeSmall organic molecule
Emp. Form.C24H35N5O4S2
Mol. Mass.521.696
SMILESC[C@@H]1NC(=O)C(C)(C)NC(=O)[C@H](CCCCCSSc2ccccn2)NC(=O)[C@H]2CCCN2C1=O