Reaction Details
TargetHistone deacetylase 1
LigandBDBM50222726
Substrate/Competitorn/a
Meas. Tech.ChEMBL_457993 (CHEMBL925324)
IC50 36±n/a nM
Citation Shivashimpi, GMAmagai, SKato, TNishino, NMaeda, SNishino, TGYoshida, M Molecular design of histone deacetylase inhibitors by aromatic ring shifting in chlamydocin framework. Bioorg Med Chem15:7830-9 (2007) 
 
Histone deacetylase 1
Name:Histone deacetylase 1
Type:Enzyme
Mol. Mass.:55090.27
Organism:Homo sapiens (Human)
Description:Q13547
Residue:482
BDBM50222726
NameBDBM50222726
Synonyms:CHEMBL393260 | cyclo(-L-Am7(S2Py)-L-A1in-L-Ala-D-Pro-)
TypeSmall organic molecule
Emp. Form.C30H37N5O4S2
Mol. Mass.595.776
SMILESC[C@@H]1NC(=O)[C@]2(CCc3ccccc23)NC(=O)[C@H](CCCCCSSc2ccccn2)NC(=O)[C@H]2CCCN2C1=O