Reaction Details
TargetHistone deacetylase 4
LigandBDBM50222735
Substrate/Competitorn/a
Meas. Tech.ChEMBL_457994 (CHEMBL925325)
IC50 2.4±n/a nM
Citation Shivashimpi, GMAmagai, SKato, TNishino, NMaeda, SNishino, TGYoshida, M Molecular design of histone deacetylase inhibitors by aromatic ring shifting in chlamydocin framework. Bioorg Med Chem15:7830-9 (2007) 
 
Histone deacetylase 4
Name:Histone deacetylase 4
Type:Enzyme
Mol. Mass.:119049.39
Organism:Homo sapiens (Human)
Description:P56524
Residue:1084
BDBM50222735
NameBDBM50222735
Synonyms:CHEMBL390991 | cyclo(-L-Am7(S2Py)-D-A1in-L-Ala-D-Pro-)
TypeSmall organic molecule
Emp. Form.C30H37N5O4S2
Mol. Mass.595.776
SMILESC[C@@H]1NC(=O)[C@@]2(CCc3ccccc23)NC(=O)[C@H](CCCCCSSc2ccccn2)NC(=O)[C@H]2CCCN2C1=O