Reaction Details
TargetHistone deacetylase 4
LigandBDBM50222727
Substrate/Competitorn/a
Meas. Tech.ChEMBL_457994 (CHEMBL925325)
IC50 5.2±n/a nM
Citation Shivashimpi, GMAmagai, SKato, TNishino, NMaeda, SNishino, TGYoshida, M Molecular design of histone deacetylase inhibitors by aromatic ring shifting in chlamydocin framework. Bioorg Med Chem15:7830-9 (2007) 
 
Histone deacetylase 4
Name:Histone deacetylase 4
Type:Enzyme
Mol. Mass.:119049.39
Organism:Homo sapiens (Human)
Description:P56524
Residue:1084
BDBM50222727
NameBDBM50222727
Synonyms:(5S,11S,13aR)-5,8,8-trimethyl-11-[5-(pyridin-2-yldisulfanyl)-pentyl]-decahydro-3a,6,9,12-tetraaza-cyclopetacyclododecene-4,7,10,13-tetraone cyclo(-L-Am7(S2Py)-Aib-L-Ala-D-Pro-)
TypeSmall organic molecule
Emp. Form.C24H35N5O4S2
Mol. Mass.521.696
SMILESC[C@@H]1NC(=O)C(C)(C)NC(=O)[C@H](CCCCCSSc2ccccn2)NC(=O)[C@H]2CCCN2C1=O