Reaction Details
TargetHistone deacetylase 4
LigandBDBM19130
Substrate/Competitorn/a
Meas. Tech.ChEMBL_457994 (CHEMBL925325)
IC50 2±n/a nM
Citation Shivashimpi, GMAmagai, SKato, TNishino, NMaeda, SNishino, TGYoshida, M Molecular design of histone deacetylase inhibitors by aromatic ring shifting in chlamydocin framework. Bioorg Med Chem15:7830-9 (2007) 
 
Histone deacetylase 4
Name:Histone deacetylase 4
Type:Enzyme
Mol. Mass.:119049.39
Organism:Homo sapiens (Human)
Description:P56524
Residue:1084
BDBM19130
NameBDBM19130
Synonyms:(2E,4E,6R)-7-[4-(dimethylamino)phenyl]-N-hydroxy-4,6-dimethyl-7-oxohepta-2,4-dienamide TSA | Trichostatin A (TSA)
TypeSmall organic molecule
Emp. Form.C17H22N2O3
Mol. Mass.302.3682
SMILESCC(C=CC(=O)NO)C=C(C)C(=O)c1ccc(cc1)N(C)C