Reaction Details
TargetRyanodine receptor
LigandBDBM50222771
Substrate/Competitorn/a
Meas. Tech.ChEMBL_458019 (CHEMBL924288)
EC50 40±n/a nM
Citation Lahm, GPStevenson, TMSelby, TPFreudenberger, JHCordova, DFlexner, LBellin, CADubas, CMSmith, BKHughes, KAHollingshaus, JGClark, CEBenner, EA Rynaxypyr: a new insecticidal anthranilic diamide that acts as a potent and selective ryanodine receptor activator. Bioorg Med Chem Lett17:6274-9 (2007) 
 
Ryanodine receptor
Name:Ryanodine receptor
Type:PROTEIN
Mol. Mass.:580907.29
Organism:Drosophila melanogaster
Description:ChEMBL_458019
Residue:5127
BDBM50222771
NameBDBM50222771
Synonyms:3-bromo-N-(4-chloro-2-methyl-6-(methylcarbamoyl)phenyl)-1-(3-chloropyridin-2-yl)-1H-pyrazole-5-carboxamide Chlorantraniliprole
TypeSmall organic molecule
Emp. Form.C18H14BrCl2N5O2
Mol. Mass.483.146
SMILESCNC(=O)c1cc(Cl)cc(C)c1NC(=O)c1cc(Br)nn1-c1ncccc1Cl