Reaction Details
TargetCannabinoid receptor 2
LigandBDBM50222797
Substrate/Competitorn/a
Meas. Tech.ChEMBL_458035 (CHEMBL924304)
EC50 0.6±n/a nM
Citation Pagé, DYang, HBrown, WWalpole, CFleurent, MFyfe, MGaudreault, FSt-Onge, S New 1,2,3,4-tetrahydropyrrolo[3,4-b]indole derivatives as selective CB2 receptor agonists. Bioorg Med Chem Lett17:6183-7 (2007) 
 
Cannabinoid receptor 2
Name:Cannabinoid receptor 2
Type:G Protein-Coupled Receptor (GPCR)
Mol. Mass.:39690.94
Organism:Homo sapiens (Human)
Description:P34972
Residue:360
BDBM50222797
NameBDBM50222797
Synonyms:(2-cyclopentyl-4-(methylsulfonyl)-1,2,3,4-tetrahydropyrrolo[3,4-b]indol-7-yl)(4-methylpiperidin-1-yl)methanone | CHEMBL249024
TypeSmall organic molecule
Emp. Form.C23H31N3O3S
Mol. Mass.429.576
SMILESCC1CCN(CC1)C(=O)c1ccc2n(c3CN(Cc3c2c1)C1CCCC1)S(C)(=O)=O