Reaction Details
TargetCannabinoid receptor 2
LigandBDBM50222806
Substrate/Competitorn/a
Meas. Tech.ChEMBL_458033 (CHEMBL924302)
Ki 216±n/a nM
Citation Pagé, DYang, HBrown, WWalpole, CFleurent, MFyfe, MGaudreault, FSt-Onge, S New 1,2,3,4-tetrahydropyrrolo[3,4-b]indole derivatives as selective CB2 receptor agonists. Bioorg Med Chem Lett17:6183-7 (2007) 
 
Cannabinoid receptor 2
Name:Cannabinoid receptor 2
Type:G Protein-Coupled Receptor (GPCR)
Mol. Mass.:39690.94
Organism:Homo sapiens (Human)
Description:P34972
Residue:360
BDBM50222806
NameBDBM50222806
Synonyms:(4-(ethylsulfonyl)-2-(tetrahydro-2H-pyran-4-yl)-1,2,3,4-tetrahydropyrrolo[3,4-b]indol-7-yl)(4-methylpiperidin-1-yl)methanone | CHEMBL250194
TypeSmall organic molecule
Emp. Form.C24H33N3O4S
Mol. Mass.459.602
SMILESCCS(=O)(=O)n1c2CN(Cc2c2cc(ccc12)C(=O)N1CCC(C)CC1)C1CCOCC1