Reaction Details
TargetCannabinoid receptor 2
LigandBDBM50222803
Substrate/Competitorn/a
Meas. Tech.ChEMBL_458033 (CHEMBL924302)
Ki 935±n/a nM
Citation Pagé, DYang, HBrown, WWalpole, CFleurent, MFyfe, MGaudreault, FSt-Onge, S New 1,2,3,4-tetrahydropyrrolo[3,4-b]indole derivatives as selective CB2 receptor agonists. Bioorg Med Chem Lett17:6183-7 (2007) 
 
Cannabinoid receptor 2
Name:Cannabinoid receptor 2
Type:G Protein-Coupled Receptor (GPCR)
Mol. Mass.:39690.94
Organism:Homo sapiens (Human)
Description:P34972
Residue:360
BDBM50222803
NameBDBM50222803
Synonyms:(2-(cyclohexylmethyl)-4-(ethylsulfonyl)-1,2,3,4-tetrahydropyrrolo[3,4-b]indol-7-yl)(4-methylpiperidin-1-yl)methanone | CHEMBL250810
TypeSmall organic molecule
Emp. Form.C26H37N3O3S
Mol. Mass.471.655
SMILESCCS(=O)(=O)n1c2CN(CC3CCCCC3)Cc2c2cc(ccc12)C(=O)N1CCC(C)CC1