Reaction Details
TargetCannabinoid receptor 1
LigandBDBM50222788
Substrate/Competitorn/a
Meas. Tech.ChEMBL_458032 (CHEMBL924301)
Ki 2331±n/a nM
Citation Pagé, DYang, HBrown, WWalpole, CFleurent, MFyfe, MGaudreault, FSt-Onge, S New 1,2,3,4-tetrahydropyrrolo[3,4-b]indole derivatives as selective CB2 receptor agonists. Bioorg Med Chem Lett17:6183-7 (2007) 
 
Cannabinoid receptor 1
Name:Cannabinoid receptor 1
Type:G Protein-Coupled Receptor (GPCR)
Mol. Mass.:52868.96
Organism:Homo sapiens (Human)
Description:P21554
Residue:472
BDBM50222788
NameBDBM50222788
Synonyms:1-(2-cyclopentyl-7-(4-methylpiperidine-1-carbonyl)-2,3-dihydropyrrolo[3,4-b]indol-4(1H)-yl)ethanone | CHEMBL400051
TypeSmall organic molecule
Emp. Form.C24H31N3O2
Mol. Mass.393.5218
SMILESCC1CCN(CC1)C(=O)c1ccc2n(C(C)=O)c3CN(Cc3c2c1)C1CCCC1