Reaction Details
TargetCannabinoid receptor 1
LigandBDBM50222811
Substrate/Competitorn/a
Meas. Tech.ChEMBL_458032 (CHEMBL924301)
Ki 137±n/a nM
Citation Pagé, DYang, HBrown, WWalpole, CFleurent, MFyfe, MGaudreault, FSt-Onge, S New 1,2,3,4-tetrahydropyrrolo[3,4-b]indole derivatives as selective CB2 receptor agonists. Bioorg Med Chem Lett17:6183-7 (2007) 
 
Cannabinoid receptor 1
Name:Cannabinoid receptor 1
Type:G Protein-Coupled Receptor (GPCR)
Mol. Mass.:52868.96
Organism:Homo sapiens (Human)
Description:P21554
Residue:472
BDBM50222811
NameBDBM50222811
Synonyms:(2-cyclopentyl-4-(cyclopropylsulfonyl)-1,2,3,4-tetrahydropyrrolo[3,4-b]indol-7-yl)(4-methylpiperidin-1-yl)methanone | CHEMBL404211
TypeSmall organic molecule
Emp. Form.C25H33N3O3S
Mol. Mass.455.613
SMILESCC1CCN(CC1)C(=O)c1ccc2n(c3CN(Cc3c2c1)C1CCCC1)S(=O)(=O)C1CC1