Reaction Details
TargetCannabinoid receptor 2
LigandBDBM50222798
Substrate/Competitorn/a
Meas. Tech.ChEMBL_458035 (CHEMBL924304)
EC50 1.7±n/a nM
Citation Pagé, DYang, HBrown, WWalpole, CFleurent, MFyfe, MGaudreault, FSt-Onge, S New 1,2,3,4-tetrahydropyrrolo[3,4-b]indole derivatives as selective CB2 receptor agonists. Bioorg Med Chem Lett17:6183-7 (2007) 
 
Cannabinoid receptor 2
Name:Cannabinoid receptor 2
Type:G Protein-Coupled Receptor (GPCR)
Mol. Mass.:39690.94
Organism:Homo sapiens (Human)
Description:P34972
Residue:360
BDBM50222798
NameBDBM50222798
Synonyms:(2-cyclopentyl-4-(ethylsulfonyl)-1,2,3,4-tetrahydropyrrolo[3,4-b]indol-7-yl)(piperidin-1-yl)methanone | CHEMBL250493
TypeSmall organic molecule
Emp. Form.C23H31N3O3S
Mol. Mass.429.576
SMILESCCS(=O)(=O)n1c2CN(Cc2c2cc(ccc12)C(=O)N1CCCCC1)C1CCCC1