Reaction Details
TargetCannabinoid receptor 1
LigandBDBM50222805
Substrate/Competitorn/a
Meas. Tech.ChEMBL_458032 (CHEMBL924301)
Ki 66.3±n/a nM
Citation Pagé, DYang, HBrown, WWalpole, CFleurent, MFyfe, MGaudreault, FSt-Onge, S New 1,2,3,4-tetrahydropyrrolo[3,4-b]indole derivatives as selective CB2 receptor agonists. Bioorg Med Chem Lett17:6183-7 (2007) 
 
Cannabinoid receptor 1
Name:Cannabinoid receptor 1
Type:G Protein-Coupled Receptor (GPCR)
Mol. Mass.:52868.96
Organism:Homo sapiens (Human)
Description:P21554
Residue:472
BDBM50222805
NameBDBM50222805
Synonyms:(2-cyclopentyl-4-(ethylsulfonyl)-1,2,3,4-tetrahydropyrrolo[3,4-b]indol-7-yl)(4-methylpiperidin-1-yl)methanone | CHEMBL249025
TypeSmall organic molecule
Emp. Form.C24H33N3O3S
Mol. Mass.443.602
SMILESCCS(=O)(=O)n1c2CN(Cc2c2cc(ccc12)C(=O)N1CCC(C)CC1)C1CCCC1