Reaction Details
TargetCannabinoid receptor 2
LigandBDBM50222812
Substrate/Competitorn/a
Meas. Tech.ChEMBL_458033 (CHEMBL924302)
Ki 22.3±n/a nM
Citation Pagé, DYang, HBrown, WWalpole, CFleurent, MFyfe, MGaudreault, FSt-Onge, S New 1,2,3,4-tetrahydropyrrolo[3,4-b]indole derivatives as selective CB2 receptor agonists. Bioorg Med Chem Lett17:6183-7 (2007) 
 
Cannabinoid receptor 2
Name:Cannabinoid receptor 2
Type:G Protein-Coupled Receptor (GPCR)
Mol. Mass.:39690.94
Organism:Homo sapiens (Human)
Description:P34972
Residue:360
BDBM50222812
NameBDBM50222812
Synonyms:CHEMBL399949 | N-butyl-2-cyclopentyl-4-(ethylsulfonyl)-N-methyl-1,2,3,4-tetrahydropyrrolo[3,4-b]indole-7-carboxamide
TypeSmall organic molecule
Emp. Form.C23H33N3O3S
Mol. Mass.431.591
SMILESCCCCN(C)C(=O)c1ccc2n(c3CN(Cc3c2c1)C1CCCC1)S(=O)(=O)CC