Reaction Details
TargetHypoxia-inducible factor 1-alpha
LigandBDBM50222818
Substrate/Competitorn/a
Meas. Tech.ChEMBL_458037 (CHEMBL924306)
IC50 600±n/a nM
Citation Boovanahalli, SKJin, XJin, YKim, JHDat, NTHong, YSLee, JHJung, SHLee, KLee, JJ Synthesis of (aryloxyacetylamino)-isonicotinic/nicotinic acid analogues as potent hypoxia-inducible factor (HIF)-1alpha inhibitors. Bioorg Med Chem Lett17:6305-10 (2007) 
 
Hypoxia-inducible factor 1-alpha
Name:Hypoxia-inducible factor 1-alpha
Type:Protein
Mol. Mass.:92647.24
Organism:Homo sapiens (Human)
Description:Q16665
Residue:826
BDBM50222818
NameBDBM50222818
Synonyms:2-[2-(4-adamantan-1-yl-phenoxy)-acetylamino]-isonicotinamide | CHEMBL249027
TypeSmall organic molecule
Emp. Form.C24H27N3O3
Mol. Mass.405.4895
SMILESNC(=O)c1ccnc(NC(=O)COc2ccc(cc2)C23CC4CC(CC(C4)C2)C3)c1