Reaction Details
TargetCorticotropin-releasing factor receptor 1
LigandBDBM50222975
Substrate/Competitorn/a
Meas. Tech.ChEMBL_458068 (CHEMBL925405)
Ki 222±n/a nM
Citation Corbett, JWRauckhorst, MRQian, FHoffman, RLKnauer, CSFitzgerald, LW Heteroatom-linked indanylpyrazines are corticotropin releasing factor type-1 receptor antagonists. Bioorg Med Chem Lett17:6250-6 (2007) 
 
Corticotropin-releasing factor receptor 1
Name:Corticotropin-releasing factor receptor 1
Type:Enzyme
Mol. Mass.:50744.31
Organism:Homo sapiens (Human)
Description:P34998
Residue:444
BDBM50222975
NameBDBM50222975
Synonyms:3,6-diethyl-N-((1R,2S)-2-methoxy-2,3-dihydro-1H-inden-1-yl)-5-(4-methylpyridin-2-yloxy)pyrazin-2-amine | CHEMBL251397
TypeSmall organic molecule
Emp. Form.C24H28N4O2
Mol. Mass.404.5047
SMILESCCc1nc(Oc2cc(C)ccn2)c(CC)nc1N[C@H]1[C@H](Cc2ccccc12)OC