Reaction Details
TargetCorticotropin-releasing factor receptor 1
LigandBDBM50222978
Substrate/Competitorn/a
Meas. Tech.ChEMBL_458068 (CHEMBL925405)
Ki 401±n/a nM
Citation Corbett, JWRauckhorst, MRQian, FHoffman, RLKnauer, CSFitzgerald, LW Heteroatom-linked indanylpyrazines are corticotropin releasing factor type-1 receptor antagonists. Bioorg Med Chem Lett17:6250-6 (2007) 
 
Corticotropin-releasing factor receptor 1
Name:Corticotropin-releasing factor receptor 1
Type:Enzyme
Mol. Mass.:50744.31
Organism:Homo sapiens (Human)
Description:P34998
Residue:444
BDBM50222978
NameBDBM50222978
Synonyms:3,6-dimethyl-5-(4-methylpyridin-2-yloxy)-N-(pentan-3-yl)pyrazin-2-amine | CHEMBL401295
TypeSmall organic molecule
Emp. Form.C17H24N4O
Mol. Mass.300.3987
SMILESCCC(CC)Nc1nc(C)c(Oc2cc(C)ccn2)nc1C