Reaction Details
TargetCorticotropin-releasing factor receptor 1
LigandBDBM50223028
Substrate/Competitorn/a
Meas. Tech.ChEMBL_458068 (CHEMBL925405)
Ki 115±n/a nM
Citation Corbett, JWRauckhorst, MRQian, FHoffman, RLKnauer, CSFitzgerald, LW Heteroatom-linked indanylpyrazines are corticotropin releasing factor type-1 receptor antagonists. Bioorg Med Chem Lett17:6250-6 (2007) 
 
Corticotropin-releasing factor receptor 1
Name:Corticotropin-releasing factor receptor 1
Type:Enzyme
Mol. Mass.:50744.31
Organism:Homo sapiens (Human)
Description:P34998
Residue:444
BDBM50223028
NameBDBM50223028
Synonyms:CHEMBL250616 | N2-(3,5-dichloropyridin-2-yl)-3,6-diethyl-N5-(pentan-3-yl)pyrazine-2,5-diamine
TypeSmall organic molecule
Emp. Form.C18H25Cl2N5
Mol. Mass.382.331
SMILESCCC(CC)Nc1nc(CC)c(Nc2ncc(Cl)cc2Cl)nc1CC