Reaction Details
TargetCorticotropin-releasing factor receptor 1
LigandBDBM50223032
Substrate/Competitorn/a
Meas. Tech.ChEMBL_458068 (CHEMBL925405)
Ki 456±n/a nM
Citation Corbett, JWRauckhorst, MRQian, FHoffman, RLKnauer, CSFitzgerald, LW Heteroatom-linked indanylpyrazines are corticotropin releasing factor type-1 receptor antagonists. Bioorg Med Chem Lett17:6250-6 (2007) 
 
Corticotropin-releasing factor receptor 1
Name:Corticotropin-releasing factor receptor 1
Type:Enzyme
Mol. Mass.:50744.31
Organism:Homo sapiens (Human)
Description:P34998
Residue:444
BDBM50223032
NameBDBM50223032
Synonyms:CHEMBL402717 | N-((1R,2S)-2-ethoxy-2,3-dihydro-1H-inden-1-yl)-3,6-diethyl-5-(5-methylpyridin-2-yloxy)pyrazin-2-amine
TypeSmall organic molecule
Emp. Form.C25H30N4O2
Mol. Mass.418.5313
SMILESCCO[C@H]1Cc2ccccc2[C@H]1Nc1nc(CC)c(Oc2ccc(C)cn2)nc1CC