Reaction Details
TargetProthrombin
LigandBDBM50223065
Substrate/Competitorn/a
Meas. Tech.ChEMBL_458088 (CHEMBL924350)
Ki 4.7±n/a nM
Citation Lee, LKreutter, KDPan, WCrysler, CSpurlino, JPlayer, MRTomczuk, BLu, T 2-(2-Chloro-6-fluorophenyl)acetamides as potent thrombin inhibitors. Bioorg Med Chem Lett17:6266-9 (2007) 
 
Prothrombin
Name:Prothrombin
Type:Protein
Mol. Mass.:70029.57
Organism:Homo sapiens (Human)
Description:P00734
Residue:622
BDBM50223065
NameBDBM50223065
Synonyms:CHEMBL250460 | N-[2-(carbamimidamidooxy)ethyl]-2-(6-chloro-3-{[2,2-difluoro-2-(isoquinolin-5-yl)ethyl]amino}-2-fluorophenyl)acetamide
TypeSmall organic molecule
Emp. Form.C22H22ClF3N6O2
Mol. Mass.494.897
SMILES[#7]\[#6](-[#7])=[#7]\[#8]-[#6]-[#6]-[#7]-[#6](=O)-[#6]-c1c(Cl)ccc(-[#7]-[#6]C(F)(F)c2cccc3cnccc23)c1F