Reaction Details
TargetProthrombin
LigandBDBM50223069
Substrate/Competitorn/a
Meas. Tech.ChEMBL_458088 (CHEMBL924350)
Ki 3.1±n/a nM
Citation Lee, LKreutter, KDPan, WCrysler, CSpurlino, JPlayer, MRTomczuk, BLu, T 2-(2-Chloro-6-fluorophenyl)acetamides as potent thrombin inhibitors. Bioorg Med Chem Lett17:6266-9 (2007) 
 
Prothrombin
Name:Prothrombin
Type:Protein
Mol. Mass.:70029.57
Organism:Homo sapiens (Human)
Description:P00734
Residue:622
BDBM50223069
NameBDBM50223069
Synonyms:CHEMBL250461 | N-[2-(carbamimidamidooxy)ethyl]-2-(6-chloro-3-{[2,2-difluoro-2-(4-fluoronaphthalen-1-yl)ethyl]amino}-2-fluorophenyl)acetamide
TypeSmall organic molecule
Emp. Form.C23H22ClF4N5O2
Mol. Mass.511.9
SMILES[#7]\[#6](-[#7])=[#7]\[#8]-[#6]-[#6]-[#7]-[#6](=O)-[#6]-c1c(Cl)ccc(-[#7]-[#6]C(F)(F)c2ccc(F)c3ccccc23)c1F