Reaction Details
TargetProthrombin
LigandBDBM50223078
Substrate/Competitorn/a
Meas. Tech.ChEMBL_458088 (CHEMBL924350)
Ki 3.3±n/a nM
Citation Lee, LKreutter, KDPan, WCrysler, CSpurlino, JPlayer, MRTomczuk, BLu, T 2-(2-Chloro-6-fluorophenyl)acetamides as potent thrombin inhibitors. Bioorg Med Chem Lett17:6266-9 (2007) 
 
Prothrombin
Name:Prothrombin
Type:Protein
Mol. Mass.:70029.57
Organism:Homo sapiens (Human)
Description:P00734
Residue:622
BDBM50223078
NameBDBM50223078
Synonyms:CHEMBL250465 | N-((6-amino-2,4-dimethylpyridin-3-yl)methyl)-2-(6-chloro-3-(2,2-difluoro-2-phenylethylamino)-2-fluorophenyl)acetamide
TypeSmall organic molecule
Emp. Form.C24H24ClF3N4O
Mol. Mass.476.922
SMILESCc1cc(N)nc(C)c1CNC(=O)Cc1c(Cl)ccc(NCC(F)(F)c2ccccc2)c1F