Reaction Details
TargetSodium channel protein type 9 subunit alpha
LigandBDBM50223140
Substrate/Competitorn/a
Meas. Tech.ChEMBL_458097 (CHEMBL924359)
IC50 22±n/a nM
Citation Hoyt, SBLondon, COk, HGonzalez, EDuffy, JLAbbadie, CDean, BFelix, JPGarcia, MLJochnowitz, NKaranam, BVLi, XLyons, KAMcGowan, EMacintyre, DEMartin, WJPriest, BTSmith, MMTschirret-Guth, RWarren, VAWilliams, BSKaczorowski, GJParsons, WH Benzazepinone Nav1.7 blockers: potential treatments for neuropathic pain. Bioorg Med Chem Lett17:6172-7 (2007) 
 
Sodium channel protein type 9 subunit alpha
Name:Sodium channel protein type 9 subunit alpha
Type:Protein
Mol. Mass.:226375.97
Organism:Homo sapiens (Human)
Description:Q15858
Residue:1988
BDBM50223140
NameBDBM50223140
Synonyms:CHEMBL429828 | N-((R)-1-((R)-1-isopropyl-2-oxo-2,3,4,5-tetrahydro-1H-benzo[b]azepin-3-ylamino)-1-oxo-3-(2-(trifluoromethoxy)phenyl)propan-2-yl)benzamide
TypeSmall organic molecule
Emp. Form.C30H30F3N3O4
Mol. Mass.553.5721
SMILESCC(C)N1c2ccccc2CC[C@@H](NC(=O)[C@@H](Cc2ccccc2OC(F)(F)F)NC(=O)c2ccccc2)C1=O