Reaction Details
TargetUrease
LigandBDBM50223161
Substrate/Competitorn/a
Meas. Tech.ChEMBL_458108 (CHEMBL924370)
Ki 25±n/a nM
Citation Sivapriya, KSuguna, PBanerjee, ASaravanan, VRao, DNChandrasekaran, S Facile one-pot synthesis of thio and selenourea derivatives: a new class of potent urease inhibitors. Bioorg Med Chem Lett17:6387-91 (2007) 
 
Urease
Name:Urease
Type:Enzyme
Mol. Mass.:90746.20
Organism:Canavalia ensiformis (Jack bean) (Horse bean)
Description:P07374
Residue:840
BDBM50223161
NameBDBM50223161
Synonyms:1-cyclohexyl-1-isopropyl-3,3-dimethylselenourea | CHEMBL399930
TypeSmall organic molecule
Emp. Form.C12H24N2Se
Mol. Mass.275.29
SMILESCC(C)N(C1CCCCC1)C(=[Se])N(C)C