Reaction Details
Target5-hydroxytryptamine receptor 2A
LigandBDBM50223277
Substrate/Competitorn/a
Meas. Tech.ChEMBL_458156 (CHEMBL924413)
Ki 47±n/a nM
Citation Tasler, SKraus, JWuzik, AMüller, OAschenbrenner, ACubero, EPascual, RQuintana-Ruiz, JRDordal, AMercè, RCodony, X Discovery of 5-HT6 receptor ligands based on virtual HTS. Bioorg Med Chem Lett17:6224-9 (2007) 
 
5-hydroxytryptamine receptor 2A
Name:5-hydroxytryptamine receptor 2A
Type:undefined
Mol. Mass.:52607.65
Organism:Homo sapiens (Human)
Description:P28223
Residue:471
BDBM50223277
NameBDBM50223277
Synonyms:2-(benzylamino)-4-(4-methylpiperazin-1-yl)benzonitrile | CHEMBL250401
TypeSmall organic molecule
Emp. Form.C19H22N4
Mol. Mass.306.4048
SMILESCN1CCN(CC1)c1ccc(C#N)c(NCc2ccccc2)c1