Reaction Details
Target5-hydroxytryptamine receptor 6
LigandBDBM50223303
Substrate/Competitorn/a
Meas. Tech.ChEMBL_458154 (CHEMBL924411)
Ki 27±n/a nM
Citation Tasler, SKraus, JWuzik, AMüller, OAschenbrenner, ACubero, EPascual, RQuintana-Ruiz, JRDordal, AMercè, RCodony, X Discovery of 5-HT6 receptor ligands based on virtual HTS. Bioorg Med Chem Lett17:6224-9 (2007) 
 
5-hydroxytryptamine receptor 6
Name:5-hydroxytryptamine receptor 6
Type:G Protein-Coupled Receptor (GPCR)
Mol. Mass.:46968.43
Organism:Homo sapiens (Human)
Description:P50406
Residue:440
BDBM50223303
NameBDBM50223303
Synonyms:1-methyl-4-(4-nitro-3-phenoxyphenyl)piperazine | CHEMBL250677
TypeSmall organic molecule
Emp. Form.C17H19N3O3
Mol. Mass.313.3511
SMILESCN1CCN(CC1)c1ccc(c(Oc2ccccc2)c1)[N+]([O-])=O