Reaction Details
Target5-hydroxytryptamine receptor 6
LigandBDBM50223305
Substrate/Competitorn/a
Meas. Tech.ChEMBL_458154 (CHEMBL924411)
Ki 61±n/a nM
Citation Tasler, SKraus, JWuzik, AMüller, OAschenbrenner, ACubero, EPascual, RQuintana-Ruiz, JRDordal, AMercè, RCodony, X Discovery of 5-HT6 receptor ligands based on virtual HTS. Bioorg Med Chem Lett17:6224-9 (2007) 
 
5-hydroxytryptamine receptor 6
Name:5-hydroxytryptamine receptor 6
Type:G Protein-Coupled Receptor (GPCR)
Mol. Mass.:46968.43
Organism:Homo sapiens (Human)
Description:P50406
Residue:440
BDBM50223305
NameBDBM50223305
Synonyms:CHEMBL251005 | N-(furan-2-ylmethyl)-5-(4-methylpiperazin-1-yl)-2-nitrobenzenamine
TypeSmall organic molecule
Emp. Form.C16H20N4O3
Mol. Mass.316.355
SMILESCN1CCN(CC1)c1ccc(c(NCc2ccco2)c1)[N+]([O-])=O